Uploaded image for project: 'Appcelerator Studio'
  1. Appcelerator Studio
  2. TISTUD-6349

BlackBerry: Projects do not build due to problem with BlackBerry NDK downloaded using the Studio Configuration Wizard

    Details

    • Type: Bug
    • Status: Closed
    • Priority: Medium
    • Resolution: Won't Fix
    • Affects Version/s: Release 3.2.3
    • Fix Version/s: None
    • Component/s: BlackBerry, Configuration
    • Environment:

      Mac 10.9.2
      Windows 7, 8, 8.1
      Appcelerator Studio, build: 3.2.3.201404162038
      Titanium SDK, build: 3.2.3.v20140418101718
      Titanium CLI, build: 3.2.3-beta2
      Alloy: 1.3.1

      Description

      Description

      When building the project to the emulator I get the following error:

      Windows:

      [Command] :C:\bbndk\not found && blackberry-nativepackager.bat ...
      [Command] :C:\bbndk\not found && blackberry-deploy.bat ...
      Error: Command failed: 'C:\bbndk\not' is not recognized as an internal or external command, operable program or batch file.
      Error: Command failed: 'C:\bbndk\not' is not recognized as an internal or external command, operable program or batch file.
      'C:\bbndk\not' is not recognized as an internal or external command, operable program or batch file.
      

      Mac:

      Error: Command failed: ../../common.mk:46: /qmacros.mk: No such file or directory
      ../../common.mk:51: /qtargets.mk: No such file or directory
      make[2]: *** No rule to make target `/qtargets.mk;. Stop.
      make[1]: *** [all] Error 2
      make: *** [all] Error 2
      ../../common.mk:46: /qmacros.mk: No such file or directory
      ../../common.mk:51: /qtargets.mk: No such file or directory
      make[2]: *** No rule to make target `/qtargets.mk;. Stop.
      make[1]: *** [all] Error 2
      make: *** [all] Error 2
      

      Steps To Reproduce

      1. Install BlackBerry SDK using the Studio Configuration Wizard
      2. Create a BlackBerry project
      3. Build to device or emulator

      Expected Result

      Application should build and install to device/emulator

      Actual Result

      Application fails with the error messages above

      Workaround
      Install the Momentics IDE and download the SDK from there.

        Attachments

          Activity

            People

            • Assignee:
              pinnamuri Praveen Innamuri (Inactive)
              Reporter:
              sdowse Samuel Dowse
            • Watchers:
              3 Start watching this issue

              Dates

              • Created:
                Updated:
                Resolved: