Uploaded image for project: 'Appcelerator Studio'
  1. Appcelerator Studio
  2. TISTUD-1256

Not able to create Titanium Android Module

    Details

    • Type: Bug
    • Status: Closed
    • Priority: Medium
    • Resolution: Cannot Reproduce
    • Affects Version/s: None
    • Fix Version/s: None
    • Component/s: None
    • Labels:
    • Environment:

      Windows 7 Ultimate 64 bit,
      Intel Pentium CPU P6000 @ 1.87GHz,
      2 GB RAM,
      Titanium 1.8.0.1

      Description

      Problem Description

      I tried to create a test module on the Titanium Studio. It was created successfully, when I tried package it as Titanium Module it shows me "Exception Occurred during launch" as error in Studio. I'm attaching the images of my system environment and the error screen I got.

      Expected Results

      The module created properly

      Actual results

      Failing with an error.

      Logs

      When I try to build that in command prompt I got the following error

      BUILD FAILED
      C:\Users\ram\AppData\Roaming\Titanium\mobilesdk\win32\1.8.0.1\module\android\bui
      ld.xml:103: Execute failed: java.io.IOException: Cannot run program "C:\Users\ra
      m\AppData\Roaming\Titanium\mobilesdk\win32\1.8.0.1\module\android\bootstrap.py":
      CreateProcess error=193, %1 is not a valid Win32 application
      at java.lang.ProcessBuilder.start(ProcessBuilder.java:460)
      at java.lang.Runtime.exec(Runtime.java:593)
      at org.apache.tools.ant.taskdefs.Execute$Java13CommandLauncher.exec(Exec
      ute.java:862)
      at org.apache.tools.ant.taskdefs.Execute.launch(Execute.java:481)
      at org.apache.tools.ant.taskdefs.Execute.execute(Execute.java:495)
      at org.apache.tools.ant.taskdefs.ExecTask.runExecute(ExecTask.java:631)
      at org.apache.tools.ant.taskdefs.ExecTask.runExec(ExecTask.java:672)
      at org.apache.tools.ant.taskdefs.ExecTask.execute(ExecTask.java:498)
      at org.apache.tools.ant.UnknownElement.execute(UnknownElement.java:291)
      at sun.reflect.GeneratedMethodAccessor4.invoke(Unknown Source)
      at sun.reflect.DelegatingMethodAccessorImpl.invoke(DelegatingMethodAcces
      sorImpl.java:25)
      at java.lang.reflect.Method.invoke(Method.java:597)
      at org.apache.tools.ant.dispatch.DispatchUtils.execute(DispatchUtils.jav
      a:106)
      at org.apache.tools.ant.Task.perform(Task.java:348)
      at org.apache.tools.ant.Target.execute(Target.java:390)
      at org.apache.tools.ant.Target.performTasks(Target.java:411)
      at org.apache.tools.ant.Project.executeSortedTargets(Project.java:1399)
      at org.apache.tools.ant.Project.executeTarget(Project.java:1368)
      at org.apache.tools.ant.helper.DefaultExecutor.executeTargets(DefaultExe
      cutor.java:41)
      at org.apache.tools.ant.Project.executeTargets(Project.java:1251)
      at org.apache.tools.ant.Main.runBuild(Main.java:809)
      at org.apache.tools.ant.Main.startAnt(Main.java:217)
      at org.apache.tools.ant.launch.Launcher.run(Launcher.java:280)
      at org.apache.tools.ant.launch.Launcher.main(Launcher.java:109)
      Caused by: java.io.IOException: CreateProcess error=193, %1 is not a valid Win32
      application
      at java.lang.ProcessImpl.create(Native Method)
      at java.lang.ProcessImpl.<init>(ProcessImpl.java:81)
      at java.lang.ProcessImpl.start(ProcessImpl.java:30)
      at java.lang.ProcessBuilder.start(ProcessBuilder.java:453)
      ... 23 more

      Total time: 18 seconds

      Please give me a solution, we are really in emergency situation to create the module

      Thanks
      Ramkumar Murugadoss

        Attachments

          Activity

            People

            • Assignee:
              ingo Ingo Muschenetz
              Reporter:
              mpmiranda Mauro Parra-Miranda
            • Watchers:
              0 Start watching this issue

              Dates

              • Created:
                Updated:
                Resolved: