Uploaded image for project: 'Titanium SDK/CLI'
  1. Titanium SDK/CLI
  2. TIMOB-28099

iOS: Unable to build Hyperloop Example app on iOS 14 using Xcode 12 Command line tools

    Details

    • Type: Bug
    • Status: In QE Test
    • Priority: High
    • Resolution: Unresolved
    • Affects Version/s: Release 9.2.0
    • Fix Version/s: Release 9.2.0
    • Component/s: Hyperloop, iOS
    • Labels:
      None
    • Environment:
    • Story Points:
      5
    • Sprint:
      2020 Sprint 19

      Description

      When running the Hyperloop examples app on Xcode 12 command line tools and then running to 14.0 beta sim/device the following errors can be seen.

      Test Steps:

      1. Download Hyperloop examples app
      2. Download the latest Xcode 12 beta
      3. Download the latest iOS 14 beta for device
      4. Run Hyperloop examples app

      Simulator error:

      [ERROR]  ** BUILD FAILED **
       
      [ERROR]  The following build commands failed:
       
      [ERROR]  	CompileC /Users/samir/Desktop/Appc/Repos/hyperloop-examples/build/iphone/build/Intermediates/Hyperloop_Sample.build/Debug-iphonesimulator/Hyperloop_Sample.build/Objects-normal/x86_64/uikit.o /Users/samir/Desktop/Appc/Repos/hyperloop-examples/build/hyperloop/ios/js/uikit/uikit.m normal x86_64 objective-c com.apple.compilers.llvm.clang.1_0.compiler
       
      [ERROR]  (1 failure)
       
      Build failed. Process exited with code 1.
      

      Device error:

      [ERROR]  ** BUILD FAILED **
       
      [ERROR]  The following build commands failed:
       
      [ERROR]  	CompileC /Users/samir/Desktop/Appc/Repos/hyperloop-examples/build/iphone/build/Intermediates/Hyperloop_Sample.build/Debug-iphonesimulator/Hyperloop_Sample.build/Objects-normal/x86_64/uikit.o /Users/samir/Desktop/Appc/Repos/hyperloop-examples/build/hyperloop/ios/js/uikit/uikit.m normal x86_64 objective-c com.apple.compilers.llvm.clang.1_0.compiler
       
      [ERROR]  (1 failure)
       
      Build failed. Process exited with code 1.
      

      Expected result:
      App should be able to build and run without any issues.

      Actual result:
      Above errors are shown.

        Attachments

          Activity

            People

            • Assignee:
              jvennemann Jan Vennemann
              Reporter:
              smohammed Samir Mohammed
              Reviewer:
              Christopher Williams
            • Watchers:
              12 Start watching this issue

              Dates

              • Created:
                Updated:

                Backbone Issue Sync

                • Backbone Issue Sync is enabled for your project, but we do not have any synchronization info for this issue.

                  Git Integration