Uploaded image for project: 'Titanium SDK/CLI'
  1. Titanium SDK/CLI
  2. TIMOB-27362

Hyperloop example with Xcode 11 throws error on pod

    Details

    • Type: Bug
    • Status: Closed
    • Priority: High
    • Resolution: Fixed
    • Affects Version/s: Release 8.1.0
    • Fix Version/s: Release 8.2.0, Hyperloop 4.0.4
    • Component/s: Hyperloop
    • Labels:
    • Environment:
    • Story Points:
      13
    • Sprint:
      2019 Sprint 18, 2019 Sprint 19

      Description

      *Steps To Reproduce:*
      1.import Hyperloop example
      2.Run on iOS simulator 13

      Expected:
      Hyperloop should be installed and launch fine
      Actual:
      throws error
      [WARN] [Hyperloop] CocoaPods 2019-08-28 16:10:45.042 xcodebuild[36945:2593098] DTDeviceKit: deviceType from aa9928797e2fd58e6dce8e858e5e8afcbce393bf was NULL
      [WARN] [Hyperloop] CocoaPods 2019-08-28 16:10:45.085 xcodebuild[36945:2593092] DTDeviceKit: deviceType from aa9928797e2fd58e6dce8e858e5e8afcbce393bf was NULL
      [TRACE] [Hyperloop] CocoaPods note: Using new build system
      [WARN] [Hyperloop] CocoaPods 2019-08-28 16:10:45.387 xcodebuild[36945:2593095] unable to create build operation: Error Domain=com.apple.xcbuild Code=1 "unknown error while handling message: missingTarget(guid: "345a28d23c8e4235945c90e2e6ffcfba1a6c203c29e67926a1f49846b3a914d9")" UserInfo=

      {NSLocalizedDescription=unknown error while handling message: missingTarget(guid: "345a28d23c8e4235945c90e2e6ffcfba1a6c203c29e67926a1f49846b3a914d9")}

      [WARN] [Hyperloop] CocoaPods ** BUILD FAILED **
      [ERROR] An error occurred during build after 5s 671ms
      [ERROR] the xcodebuild failed running from /Users/kmahalingam/Documents/Appcelerator_Studio_Workspace/hyperloop-examples2/Pods

      Note:
      on Xcode 10 it is hyperloop example works fine with cocoa pod version less that 1.6
      on Xcode 11 it throws the error

        Attachments

          Activity

            People

            • Assignee:
              jvennemann Jan Vennemann
              Reporter:
              kmahalingam Keerthi Mahalingam
              Reviewer:
              Vijay Singh
              Tester:
              Josh Longton
            • Watchers:
              4 Start watching this issue

              Dates

              • Created:
                Updated:
                Resolved:

                Backbone Issue Sync

                • Backbone Issue Sync is enabled for your project, but we do not have any synchronization info for this issue.

                  Git Source Code