Details

    • Type: Bug
    • Status: Open
    • Resolution: Unresolved
    • Affects Version/s: None
    • Fix Version/s: None
    • Component/s: iOS

      Description

      Since using SDK 7.0.0.GA and also 7.0.1.GA unable to build and deploy iOS project.

      If Ti.Admob module ver 2.1.1 (that I need) is not used in project then builds OK.

      I have tried re-building the Ti.Admob module myself but building the Ti.Admob MODULE fails with the new SDK too so cannot include in project

      I have then tried recreating a new Ti.Admob module from scratch and that MODULE builds OK and if new module included in project the iOS project builds but the module is not correctly built and view is non existent

      ERROR LOG:
      [WARN] : Unable to detect framework umbrella header for GoogleMapsCore.
      [INFO] : Forcing rebuild: Xcode project has changed since last build
      [INFO] : Finished Hyperloop assembly in 7.01 seconds
      [INFO] : Invoking xcodebuild
      [ERROR] : ** BUILD FAILED **
      [ERROR] : The following build commands failed:
      [ERROR] : Ld build/Products/Debug-iphonesimulator/Real\ Road\ Racer.app/Real\ Road\ Racer normal x86_64
      [ERROR] : (1 failure)

        Attachments

          Activity

            People

            • Assignee:
              Unassigned
              Reporter:
              immiejay Imraan Jhetam
            • Watchers:
              0 Start watching this issue

              Dates

              • Created:
                Updated:

                Backbone Issue Sync

                • Titanium SDK/CLI <> Titanium Mobile
                  Synced with:
                  TIMOB-6064
                  Sync status:
                  ERROR
                  Last received:
                  Last sent:

                  Git Integration