Uploaded image for project: 'Titanium SDK/CLI'
  1. Titanium SDK/CLI
  2. TIMOB-25354

Hyperloop: iOS - Building hyperloop-examples app fails with Hyperloop 2.2.0

    Details

    • Type: Bug
    • Status: Closed
    • Priority: None
    • Resolution: Fixed
    • Affects Version/s: None
    • Fix Version/s: Hyperloop 2.2.0
    • Component/s: Hyperloop, iOS
    • Labels:
      None
    • Environment:

      Hyperloop 2.2.0 RC1
      TiSDK 6.2.0.GA

    • Story Points:
      2

      Description

      Trying to build the hyperloop-examples project fails during the last xcodebuild phase with the following error:

      [TRACE] /Users/jvennemann/Development/appc/hyperloop-examples/build/hyperloop/ios/js/myframework/myframework.m:7:9: fatal error: 'MyFramework/MyFramework.h' file not found
      [TRACE] #import <MyFramework/MyFramework.h>
      [TRACE]         ^~~~~~~~~~~~~~~~~~~~~~~~~~~
      [TRACE] 1 error generated.
      [TRACE]   
      [ERROR] ** BUILD FAILED **
      [ERROR] The following build commands failed:
      [ERROR]         CompileC build/Intermediates/Hyperloop_Sample.build/Debug-iphonesimulator/Hyperloop_Sample.build/Objects-normal/x86_64/myframework.o /Users/jvennemann/Development/appc/hyperloop-examples/build/hyperloop/ios/js/myframework/myframework.m normal x86_64 objective-c com.apple.compilers.llvm.clang.1_0.compiler
      [ERROR] (1 failure)
      

        Attachments

          Issue Links

            Activity

              People

              • Assignee:
                jvennemann Jan Vennemann
                Reporter:
                jvennemann Jan Vennemann
                Reviewer:
                Hans Knöchel
              • Watchers:
                1 Start watching this issue

                Dates

                • Created:
                  Updated:
                  Resolved:

                  Backbone Issue Sync

                  • Titanium SDK/CLI <> Titanium Mobile
                    Synced with:
                    TIMOB-5848
                    Sync status:
                    ERROR
                    Last received:
                    Last sent:

                    Git Source Code