Uploaded image for project: 'Titanium SDK/CLI'
  1. Titanium SDK/CLI
  2. TIMOB-23808

Hyperloop: iOS - Example application not building with Xcode 8 because of Swift-Error

    Details

    • Type: Bug
    • Status: Closed
    • Priority: Critical
    • Resolution: Fixed
    • Affects Version/s: None
    • Component/s: Hyperloop, iOS, Tooling
    • Labels:
    • Environment:

      Mac OSX El Capitan 10.11.6
      
Appc NPM: 4.2.7
      Appc CLI: 5.5.0-5
      
Ti SDK: 5.5.0.v20160822000355
      Hyperloop: 1.2.6
      Cocoapods: 1.0.1
      Xcode 8 beta 6
      Node: v4.4.4

    • Story Points:
      5
    • Sprint:
      2016 Sprint 20 Tooling

      Description

      Steps to reproduce:

      1. Download the hyperloop sample application from here
      2. Import the sample application.
      3. Run the application

      Actual iOS 10

      [TRACE] :  "Use Legacy Swift Language Version" (SWIFT_VERSION) is required to be configured correctly for targets which use Swift. Use the [Edit > Convert > To Current Swift Syntax...] menu to choose a Swift version or use the Build Settings editor to configure the build setting directly.
      [ERROR] :  Error details: "Use Legacy Swift Language Version" (SWIFT_VERSION) is required to be configured correctly for targets which use Swift. Use the [Edit > Convert > To Current Swift Syntax...] menu to choose a Swift version or use the Build Settings editor to configure the build setting directly.
      

      Actual iOS 9.3

      [ERROR] :  An error occurred during build after 3s 167ms
      [ERROR] :  the xcodebuild failed running from /Users/Josh/Documents/Appcelerator_Studio_Workspace/hyperloop-examples/Pods
      

      Expected

      No error is shown and the application is built.

        Attachments

          Issue Links

            Activity

              People

              • Assignee:
                jvennemann Jan Vennemann
                Reporter:
                jlongton Josh Longton
                Reviewer:
                Hans Knöchel
                Tester:
                Josh Longton
              • Watchers:
                1 Start watching this issue

                Dates

                • Created:
                  Updated:
                  Resolved:

                  Backbone Issue Sync

                  • Titanium SDK/CLI <> Titanium Mobile
                    Synced with:
                    TIMOB-10038
                    Sync status:
                    ERROR
                    Last received:
                    Last sent:

                    Git Source Code