Details

    • Type: Bug
    • Status: Closed
    • Priority: High
    • Resolution: Fixed
    • Affects Version/s: None
    • Fix Version/s: Release 6.0.0, Release 5.4.0
    • Component/s: iOS
    • Environment:
    • Story Points:
      2
    • Sprint:
      2016 Sprint 15 SDK

      Description

      I was working perfectly on iOS, when suddenly this error appeared without change any cody:

      [ERROR] :  ** BUILD FAILED **
      [ERROR] :  The following build commands failed:
      [ERROR] :  	CompileC build/Intermediates/App.build/Debug-iphoneos/App.build/Objects-normal/armv7/TiUIiOSProxy.o Classes/TiUIiOSProxy.m normal armv7 objective-c com.apple.compilers.llvm.clang.1_0.compiler
      [ERROR] :  (1 failure)
      

      Now, I can't compile the app.

        Attachments

          Activity

            People

            • Assignee:
              hknoechel Hans Knöchel
              Reporter:
              amurcia Anna
              Reviewer:
              Chee Kiat Ng (Inactive)
            • Watchers:
              0 Start watching this issue

              Dates

              • Created:
                Updated:
                Resolved:

                Backbone Issue Sync

                • Titanium SDK/CLI <> Titanium Mobile
                  Synced with:
                  TIMOB-9941
                  Sync status:
                  ERROR
                  Last received:
                  Last sent:

                  Git Source Code