Uploaded image for project: 'Titanium SDK/CLI'
  1. Titanium SDK/CLI
  2. TIMOB-17739

BlackBerry: Unable to build app in BlackBerry 10

    Details

    • Type: Bug
    • Status: Closed
    • Priority: Low
    • Resolution: Hold
    • Affects Version/s: None
    • Fix Version/s: None
    • Component/s: BlackBerry
    • Labels:
    • Environment:

      Titanium Studio 3.4.0
      Titanium SDK 3.4.0 & 3.3.0
      Blackberry SDK 10.2

      Description

      Unable to build app in BlackBerry 10

      Reproduce:

      1.Download BlackBerry SDK from Ti Studio.
      2.Create a simple app, like a tabWindow Template.
      3.Run it in BlackBerry simulator.

      Error happen, Here is the console log:

      [INFO] :   Running: make -j3 Simulator-Debug
      [INFO] :   Please wait...
      [INFO] :   make -C ./translations -f Makefile update
      [ERROR] :  Error: Command failed: dyld: Library not loaded: libQtXml.4.dylib
      cd x86 && /Applications/Momentics.app/host_10_2_0_15/darwin/x86/usr/bin/qmake -spec blackberry-x86-qcc ../SimpleTest.pro  CONFIG+=debug_and_release CONFIG+=simulator
      make[1]: Entering directory `/Users/shuoliang/Documents/Titanium_Studio_Workspace/SimpleTest/build/blackberry/translations'
      /Applications/Momentics.app/host_10_2_0_15/darwin/x86/usr/bin/lupdate SimpleTest.pro
      make[1]: Leaving directory `/Users/shuoliang/Documents/Titanium_Studio_Workspace/SimpleTest/build/blackberry/translations'
      [INFO] :   Running: blackberry-nativepackager -package build/SimpleTest.bar bar-descriptor.xml -configuration Simulator-Debug
      [INFO] :   Please wait...
        Referenced from: /Applications/Momentics.app/host_10_2_0_15/darwin/x86/usr/bin/lupdate
        Reason: no suitable image found.  Did find:
      	/Applications/Momentics.app/target_10_2_0_1155/qnx6/../darwin/x86/usr/lib/qt4/lib/libQtXml.4.dylib: file too short
      make[1]: *** [update] Trace/BPT trap: 5
      make: *** [translate] Error 2
      make: *** Waiting for unfinished jobs....
      [ERROR] :  Error: Command failed: Error: Invalid asset path "x86/o-g/SimpleTest"
      [INFO] :   Running: blackberry-deploy -installApp -launchApp -device 127.0.0.50 -password "" build/SimpleTest.bar
      ...

      N.B. There are two similar files in BlackBerry NDK: libQtXml.4.8.5.dylib and libQtXml.4.dylib. and libQtXml.4.dylib is 0 size. Also same as other libQt file.

        Attachments

          Issue Links

            Activity

              People

              • Assignee:
                penrique Pedro Enrique (Inactive)
                Reporter:
                sliang Shuo Liang
              • Watchers:
                2 Start watching this issue

                Dates

                • Created:
                  Updated:
                  Resolved:

                  Backbone Issue Sync

                  • Titanium SDK/CLI <> Titanium Mobile
                    Synced with:
                    TIMOB-19244
                    Sync status:
                    ERROR
                    Last received:
                    Last sent:

                    Git Integration