Uploaded image for project: 'Titanium SDK/CLI'
  1. Titanium SDK/CLI
  2. TIMOB-14677

BlackBerry : Getting errors when trying to build & run BB app on both device & simulator

    Details

    • Type: Bug
    • Status: Closed
    • Priority: High
    • Resolution: Fixed
    • Affects Version/s: Release 3.1.2
    • Fix Version/s: Release 3.1.2, Release 3.2.0
    • Component/s: BlackBerry
    • Environment:

      Environment:
      Ti Studio : 3.1.1.201306112235
      Ti BB SDK : 3.1.2.v20130725180746
      Mac OSX : 10.8.4
      Z10 BB simulator : 10.0.10.822
      Z10 device running 10.0.10.88

      Description

      Description:
      1. Create or use an already created app for BB & run it on BB simulator/device.
      2. Observe the studio console for logs.

      Actual Result:
      1. We get the following errors in the studio console:

      Titanium Command-Line Interface, CLI version 3.1.1, Titanium SDK version 3.1.2.v20130725180746
      Copyright (c) 2012-2013, Appcelerator, Inc.  All Rights Reserved.
      Please report bugs to http://jira.appcelerator.org/
      [INFO] :   No Titanium Modules required, continuing
      [Command] :source /Applications/bbndk/bbndk-env.sh && make TIAPP_NAME=NewtestBB CPULIST=x86 BB_ROOT=/var/folders/35/nwgw558n55951fnpxmxkjqmr0000gp/T/113626-1285-4tmgbm-NewtestBB VARIANTLIST=g 
      [INFO] :   No Titanium Modules required, continuing
      [Command] :source /Applications/bbndk/bbndk-env.sh && blackberry-nativepackager -package "/Users/lokeshchoudhary/Desktop/BB_test_workspace/NewtestBB/build/blackberry/x86/o-g/NewtestBB.bar" bar-descriptor.xml -e "/Users/lokeshchoudhary/Desktop/BB_test_workspace/NewtestBB/build/blackberry/x86/o-g/NewtestBB" "NewtestBB" -buildID 1 assets framework -devMode 
      Error: Command failed: ../../common.mk:21: *** missing separator.  Stop.
      make[1]: *** [all] Error 2
      make: *** [all] Error 2
      ../../common.mk:21: *** missing separator.  Stop.
      make[1]: *** [all] Error 2
      make: *** [all] Error 2
      make -j 1 -Cx86 -fMakefile 
      make[1]: Entering directory `/private/var/folders/35/nwgw558n55951fnpxmxkjqmr0000gp/T/113626-1285-xhpth7-NewtestBB/build/blackberry/x86'
      make -j 1 -Co-g -fMakefile 
      make[2]: Entering directory `/private/var/folders/35/nwgw558n55951fnpxmxkjqmr0000gp/T/113626-1285-xhpth7-NewtestBB/build/blackberry/x86/o-g'
      make[2]: Leaving directory `/private/var/folders/35/nwgw558n55951fnpxmxkjqmr0000gp/T/113626-1285-xhpth7-NewtestBB/build/blackberry/x86/o-g'
      make[1]: Leaving directory `/private/var/folders/35/nwgw558n55951fnpxmxkjqmr0000gp/T/113626-1285-xhpth7-NewtestBB/build/blackberry/x86'
      [Command] :source /Applications/bbndk/bbndk-env.sh && blackberry-deploy -installApp -launchApp -device 192.168.145.133 -package "/Users/lokeshchoudhary/Desktop/BB_test_workspace/NewtestBB/build/blackberry/x86/o-g/NewtestBB.bar" 
      Error: Command failed: Error: File or dir does not exist: /Users/lokeshchoudhary/Desktop/BB_test_workspace/NewtestBB/build/blackberry/x86/o-g/NewtestBB
      Error: File or dir does not exist: /Users/lokeshchoudhary/Desktop/BB_test_workspace/NewtestBB/build/blackberry/x86/o-g/NewtestBB
      Error: Command failed: Error: File does not exist or not a file or cannot read: /Users/lokeshchoudhary/Desktop/BB_test_workspace/NewtestBB/build/blackberry/x86/o-g/NewtestBB.bar 
      Error: File does not exist or not a file or cannot read: /Users/lokeshchoudhary/Desktop/BB_test_workspace/NewtestBB/build/blackberry/x86/o-g/NewtestBB.bar 
      

      Expected Result:
      1. We should not get any errors & the app should build & run normally.

        Attachments

          Activity

            People

            • Assignee:
              rmcmahon Russell McMahon
              Reporter:
              lokeshchdhry Lokesh Choudhary (Inactive)
            • Watchers:
              0 Start watching this issue

              Dates

              • Created:
                Updated:
                Resolved:

                Backbone Issue Sync

                • Titanium SDK/CLI <> Titanium Mobile
                  Synced with:
                  TIMOB-17089
                  Sync status:
                  ERROR
                  Last received:
                  Last sent:

                  Git Integration