Uploaded image for project: 'Titanium SDK/CLI'
  1. Titanium SDK/CLI
  2. TIMOB-13313

Android: Module does not pick android-platform-11 android JAR and thus android.animate method does not work

    Details

    • Type: Bug
    • Status: Closed
    • Priority: Low
    • Resolution: Invalid
    • Affects Version/s: Release 3.0.2, Release 3.1.0
    • Fix Version/s: None
    • Component/s: Android
    • Environment:

      Titanium Mobile, Module, Android.

      Description

      I tried using android-platform-11 Android JAR in module but it gives the following error message and does not run when try ant run or from eclipse.

      Note: Build Path is configured properly.

      *build.properties*

      titanium.sdk=/Users/ashish.nigam/Library/Application Support/Titanium
      titanium.os=osx
      titanium.version=3.0.2.GA
      android.sdk=/Applications/adt-bundle-mac/sdk
      android.ndk=/Applications/android-ndk
       
      titanium.platform=${titanium.sdk}/mobilesdk/${titanium.os}/${titanium.version}/android
      android.platform=/Applications/adt-bundle-mac/sdk/platforms/android-11
      google.apis=${android.sdk}/add-ons/addon-google_apis_google-11
      

      *error message in console*

      [exec] [TRACE] Writing out AndroidManifest.xml
           [exec] [DEBUG] /Applications/adt-bundle-mac/sdk/platform-tools/aapt package -m -J /var/folders/1y/_qvllvdj12bchp6yllkp5cp87s_zff/T/malL3fwti/nappmupdf/build/android/gen -M /var/folders/1y/_qvllvdj12bchp6yllkp5cp87s_zff/T/malL3fwti/nappmupdf/build/android/AndroidManifest.xml -S /var/folders/1y/_qvllvdj12bchp6yllkp5cp87s_zff/T/malL3fwti/nappmupdf/build/android/res -I /Applications/adt-bundle-mac/sdk/platforms/android-8/android.jar
           [exec] [ERROR] /var/folders/1y/_qvllvdj12bchp6yllkp5cp87s_zff/T/malL3fwti/nappmupdf/build/android/res/animator/info.xml:2: error: No resource identifier found for attribute 'ordering' in package 'android'
           [exec] [ERROR] /var/folders/1y/_qvllvdj12bchp6yllkp5cp87s_zff/T/malL3fwti/nappmupdf/build/android/res/animator/info.xml:5: error: No resource identifier found for attribute 'propertyName' in package 'android'
           [exec] [ERROR] /var/folders/1y/_qvllvdj12bchp6yllkp5cp87s_zff/T/malL3fwti/nappmupdf/build/android/res/animator/info.xml:5: error: No resource identifier found for attribute 'valueFrom' in package 'android'
           [exec] [ERROR] /var/folders/1y/_qvllvdj12bchp6yllkp5cp87s_zff/T/malL3fwti/nappmupdf/build/android/res/animator/info.xml:5: error: No resource identifier found for attribute 'valueTo' in package 'android'
           [exec] [ERROR] /var/folders/1y/_qvllvdj12bchp6yllkp5cp87s_zff/T/malL3fwti/nappmupdf/build/android/res/animator/info.xml:11: error: No resource identifier found for attribute 'propertyName' in package 'android'
           [exec] [ERROR] /var/folders/1y/_qvllvdj12bchp6yllkp5cp87s_zff/T/malL3fwti/nappmupdf/build/android/res/animator/info.xml:11: error: No resource identifier found for attribute 'valueTo' in package 'android'
           [exec] [ERROR] /var/folders/1y/_qvllvdj12bchp6yllkp5cp87s_zff/T/malL3fwti/nappmupdf/build/android/res/animator/info.xml:16: error: No resource identifier found for attribute 'propertyName' in package 'android'
           [exec] [ERROR] /var/folders/1y/_qvllvdj12bchp6yllkp5cp87s_zff/T/malL3fwti/nappmupdf/build/android/res/animator/info.xml:16: error: No resource identifier found for attribute 'valueTo' in package 'android'
           [exec] [ERROR] Error generating R.java from manifest
           [exec] [ERROR] Build Failed.
      

        Attachments

          Activity

            People

            • Assignee:
              msamah Ashraf Abu (Inactive)
              Reporter:
              anigam Ashish Nigam
            • Watchers:
              0 Start watching this issue

              Dates

              • Created:
                Updated:
                Resolved:

                Backbone Issue Sync

                • Titanium SDK/CLI <> Titanium Mobile
                  Synced with:
                  TIMOB-16087
                  Sync status:
                  ERROR
                  Last received:
                  Last sent:

                  Git Integration