Uploaded image for project: 'Titanium SDK/CLI'
  1. Titanium SDK/CLI
  2. TIMOB-12716

CLI: Build failure for projects with illegal character '_' in App id

    Details

    • Type: Bug
    • Status: Closed
    • Priority: Medium
    • Resolution: Fixed
    • Affects Version/s: Release 3.0.2
    • Fix Version/s: Release 3.1.0
    • Component/s: iOS
    • Labels:
    • Environment:

      Titanium Studio, build: 3.0.2.201302041757
      Titanium SDK, build: 3.0.2.v20130207164659
      CLI 3.0.24
      Xcode 4.6
      Devices:
      iPhone4 iOS 5.1.1
      iPad mini iOS 6.0.2

    • Story Points:
      5
    • Sprint:
      2016 Sprint 17 Tooling

      Description

      Building imported from git or created in studio projects, that contain underscore('_') in application's id, return build failure. It does build on simulator.

      Not a regression, occurs in 3.0.0.GA

      Test steps:
      1. Create project with illegal character in app id (e.g '_')
      2. Build on to device

      Actual result:
      [ERROR] :  ** BUILD FAILED **
      [ERROR] :  The following build commands failed:
      [ERROR] :   ProcessProductPackaging Entitlements.plist build/Build_timob7674.build/Debug-iphoneos/Build_timob7674-universal.build/Build_timob7674.xcent

        Attachments

          Activity

            People

            • Assignee:
              cbarber Chris Barber
              Reporter:
              oromero Olga Romero
            • Watchers:
              1 Start watching this issue

              Dates

              • Created:
                Updated:
                Resolved:

                Backbone Issue Sync

                • Titanium SDK/CLI <> Titanium Mobile
                  Synced with:
                  TIMOB-15626
                  Sync status:
                  ERROR
                  Last received:
                  Last sent:

                  Git Integration