Uploaded image for project: 'Titanium SDK/CLI'
  1. Titanium SDK/CLI
  2. TIMOB-11891

CLI: iOS: Build - Titanium mobile project fails to build intermittently

    Details

      Description

      Titanium mobile project fails to build intermittently. When the project is cleaned and build multiple times, it gets built successfully.

      Steps to reproduce:
      1. Create or import a titanium mobile project into the studio.
      2. Try to install the project on iOS simulator or device.

      Actual:
      The following error is displayed on console and the project is not build:

      [ERROR] :  ** BUILD FAILED **
      [ERROR] :  The following build commands failed:
      [ERROR] :   CompileC build/tabeviewrow_timob4658.build/Debug-iphoneos/tabeviewrow_timob4658-universal.build/Objects-normal/armv7/ApplicationRouting.o Classes/ApplicationRouting.m normal armv7 objective-c com.apple.compilers.llvm.clang.1_0.compiler
      [ERROR] :  (1 failure)

      Expected:
      The project should build successfully.

        Attachments

        1. ApplicationRouting.txt
          145 kB
        2. p-iPad.build.zip
          5.02 MB
        3. StudioConsoleLog.txt
          1 kB
        4. studio-console-log.txt
          2 kB
        5. studio-environment.txt
          9 kB
        6. studio-error-log.txt
          275 kB
        7. terminal-command-log.txt
          89 kB
        8. ti-info.txt
          26 kB
        9. TIMOB11891Logs.rtf
          229 kB

          Issue Links

            Activity

              People

              • Assignee:
                cbarber Chris Barber
                Reporter:
                amittal Anshu Mittal
                Reviewer:
                Bryan Hughes
              • Watchers:
                0 Start watching this issue

                Dates

                • Created:
                  Updated:
                  Resolved:

                  Backbone Issue Sync

                  • Titanium SDK/CLI <> Titanium Mobile
                    Synced with:
                    TIMOB-15042
                    Sync status:
                    ERROR
                    Last received:
                    Last sent:

                    Git Integration