Uploaded image for project: 'Titanium SDK/CLI'
  1. Titanium SDK/CLI
  2. TIMOB-11710

CLI build failure reason is only available when tracing is on

    Details

      Description

      When launching the build command to perform an iOS debug on device, the error log output a generic error "Check dependencies", but does not output the real error reason.

      For example:

      [TRACE] :  Check dependencies
      [TRACE] :  Code Sign error: Provisioning profile 'PayPal Labs' has expired
      [ERROR] :  ** BUILD FAILED **
      [ERROR] :  The following build commands failed:
      [ERROR] :  	Check dependencies
      [ERROR] :  (1 failure)
      

      The TRACE is actually indicating the error, not the ERROR. So, in case the CLI command is executed with an 'Error' log level, the user never gets the reason.

        Attachments

          Issue Links

            Activity

              People

              • Assignee:
                cbarber Chris Barber
                Reporter:
                sgibly Shalom Gibly
              • Watchers:
                3 Start watching this issue

                Dates

                • Created:
                  Updated:
                  Resolved:

                  Git Source Code