Uploaded image for project: 'Appcelerator - INBOX'
  1. Appcelerator - INBOX
  2. AC-5813

Can't compile hyperloop PHPhotoLibrary module

    Details

    • Type: Bug
    • Status: Resolved
    • Resolution: Invalid
    • Affects Version/s: None
    • Component/s: Hyperloop
    • Labels:
    • Environment:

      MacOS v10.13.6
      xCode 9.4.1

      Description

      I'm trying to figure out how to access the camera roll in titanium. I started a new project and added this line.

      var photos = require('Photos/PHPhotoLibrary');
      

      attempting to run the project fails with this build error.

      [ERROR] :  ** BUILD FAILED **
      [ERROR] :  The following build commands failed:
      [ERROR] :  	CompileC build/Intermediates/hyperloop-photo-album.build/Debug-iphonesimulator/hyperloop-photo-album.build/Objects-normal/x86_64/photos.o /Users/donaldanderson/Documents/Appcelerator_Studio_Workspace/hyperloop-photo-album/build/hyperloop/ios/js/photos/photos.m normal x86_64 objective-c com.apple.compilers.llvm.clang.1_0.compiler
      [ERROR] :  (1 failure)
      

        Attachments

          Activity

            People

            • Assignee:
              shossain Shak Hossain
              Reporter:
              donald.anderson Donald Anderson
            • Watchers:
              2 Start watching this issue

              Dates

              • Created:
                Updated:
                Resolved:

                Git Source Code