Uploaded image for project: 'Appcelerator - INBOX'
  1. Appcelerator - INBOX
  2. AC-5034

Third party framework throwing build error.

    Details

    • Type: Bug
    • Status: Closed
    • Resolution: Needs more info
    • Affects Version/s: Appcelerator Studio 4.5.0
    • Environment:

      Description

      My version of Appcelerator Studio is actually: Appcelerator Studio, build: 4.8.1.201612050850

      I have included a third party ios framework (dynamic) in my Titanium application, it is called KolorEyes. I have also included the ti.dynamiclib plugin to allow for dynamic libraries to be used in Titanium:

      https://gist.github.com/hansemannn/5046fcc9a14cc3d09d0874f964b443aa.

      Here is the error message I get when I try to run:

      [ERROR] : ** BUILD FAILED **
      [ERROR] : The following build commands failed:
      [ERROR] : Ld build/Products/Debug-iphonesimulator/kolor_test.app/kolor_test normal x86_64
      [ERROR] : (1 failure)

      All looks good in my setup, here is my appc.js file:

      module.exports = {
      hyperloop: {
      ios: {
      xcodebuild: {
      flags:

      { FRAMEWORK_SEARCH_PATHS: '../../src', /*LD_RUNPATH_SEARCH_PATHS: '@executable_path',*/ LD_RUNPATH_SEARCH_PATHS: '$(inherited) "@executable_path/Frameworks" $(FRAMEWORK_SEARCH_PATHS)' }

      ,
      frameworks: [
      'KolorEyes'
      ]
      },
      thirdparty: {
      'KolorEyes':

      { source: ['src'], header: 'src', resource: 'src' }

      }
      }
      }
      };

        Attachments

          Activity

            People

            • Assignee:
              shossain Shak Hossain
              Reporter:
              paul@appwapp.com paul@appwapp.com
            • Watchers:
              4 Start watching this issue

              Dates

              • Created:
                Updated:
                Resolved:

                Git Source Code